10 java Error
Error 1
public class Home
{
public static void main(String [] args)
{
System.out.println("Hello Wolrd!!!")
}
}
Output:
C:\Users\acer\Desktop\java>javac Home.java
Home.java:5: error: ';' expected
System.out.println("Hello Wolrd!!!")
^
1 error
Error 2
public class home
{
public static void main(String [] args)
{
System.out.println("Hello Wolrd!!!");
}
}
Output:
C:\Users\acer\Desktop\java>javac Home.java
Home.java:1: error: class home is public, should be declared in a file named home.java
public class home
^
1 error
Error 3
public class home
{
public Static void main(String [] args)
{
System.out.println("Hello Wolrd!!!");
}
}
Output:
C:\Users\acer\Desktop\java>javac home.java
home.java:3: error: <identifier> expected
public Static void main(String [] args)
^
1 error
Error 4
public class home
{
public static void main(String [] args)
{
System.out.println(veera);
}
}
Output:
C:\Users\acer\Desktop\java>javac home.java
home.java:5: error: cannot find symbol
System.out.println(veera);
^
symbol: variable veera
location: class home
1 error
Error 5
public class home
{
public static void main(String [] args)
{
System.out.println('veera');
}
}
Output:
C:\Users\acer\Desktop\java>javac home.java
home.java:5: error: unclosed character literal
System.out.println('veera');
^
home.java:5: error: unclosed character literal
System.out.println('veera');
^
home.java:5: error: not a statement
System.out.println('veera');
^
3 errors
Error 6
public class home
{
public static void main(string [] args)
{
System.out.println("veera");
}
}
Output:
C:\Users\acer\Desktop\java>javac home.java
home.java:3: error: cannot find symbol
public static void main(string [] args)
^
symbol: class string
location: class home
1 error
Error 7
public class home
{
public static void main(String args)
{
System.out.println("veera");
}
}
Output:
C:\Users\acer\Desktop\java>javac home.java
C:\Users\acer\Desktop\java>java home
Error: Main method not found in class home, please define the main method as:
public static void main(String[] args)
or a JavaFX application class must extend javafx.application.Application
Error 8
public class home
{
public static void main(String [] args):
{
System.out.println("veera");
}
}
Output:
C:\Users\acer\Desktop\java>javac home.java
home.java:3: error: '{' or ';' expected
public static void main(String [] args):
^
1 error
Error 9
public class home
{
public static void main(String [])
{
System.out.println("veera");
}
}
Output:
C:\Users\acer\Desktop\java>javac home.java
home.java:3: error: <identifier> expected
public static void main(String [])
^
1 error
Error 10
public class home
{
public static void main(String [] args)
{
System.Out.println("veera");
}
}
Output:
C:\Users\acer\Desktop\java>java home
veera
C:\Users\acer\Desktop\java>javac home.java
home.java:5: error: Out has private access in System
System.Out.println("veera");
^
1 error
Top comments (0)